Reaction Details
TargetSerine/threonine-protein kinase B-raf
LigandBDBM50165868
Substrate/Competitorn/a
Meas. Tech.ChEMBL_1574500 (CHEMBL3804126)
IC50 2.0±n/a nM
Citation Liu, LLee, MRKim, JLWhittington, DABregman, HHua, ZLewis, RTMartin, MWNishimura, NPotashman, MYang, KYi, SVaida, KREpstein, LFBabij, CFernando, MCarnahan, JNorman, MH Purinylpyridinylamino-based DFG-in/aC-helix-out B-Raf inhibitors: Applying mutant versus wild-type B-Raf selectivity indices for compound profiling. Bioorg Med Chem24:2215-34 (2016) 
 
Serine/threonine-protein kinase B-raf
Name:Serine/threonine-protein kinase B-raf
Type:Serine/threonine-protein kinase
Mol. Mass.:84446.00
Organism:Homo sapiens (Human)
Description:P15056
Residue:766
BDBM50165868
NameBDBM50165868
Synonyms:CHEMBL3800081
TypeSmall organic molecule
Emp. Form.C19H12F2N8O2S2
Mol. Mass.486.478
SMILESFc1ccc(NS(=O)(=O)c2nccs2)c(F)c1Nc1ncccc1-c1ncnc2[nH]cnc12