Reaction Details
TargetSerine/threonine-protein kinase B-raf
LigandBDBM50165870
Substrate/Competitorn/a
Meas. Tech.ChEMBL_1574503 (CHEMBL3804129)
IC50 6.0±n/a nM
Citation Liu, LLee, MRKim, JLWhittington, DABregman, HHua, ZLewis, RTMartin, MWNishimura, NPotashman, MYang, KYi, SVaida, KREpstein, LFBabij, CFernando, MCarnahan, JNorman, MH Purinylpyridinylamino-based DFG-in/aC-helix-out B-Raf inhibitors: Applying mutant versus wild-type B-Raf selectivity indices for compound profiling. Bioorg Med Chem24:2215-34 (2016) 
 
Serine/threonine-protein kinase B-raf
Name:Serine/threonine-protein kinase B-raf
Type:Serine/threonine-protein kinase
Mol. Mass.:84446.00
Organism:Homo sapiens (Human)
Description:P15056
Residue:766
BDBM50165870
NameBDBM50165870
Synonyms:CHEMBL3797403
TypeSmall organic molecule
Emp. Form.C19H13F2N9O2S
Mol. Mass.469.427
SMILESFc1ccc(NS(=O)(=O)c2cn[nH]c2)c(F)c1Nc1ncccc1-c1ncnc2[nH]cnc12