Reaction Details
TargetSerine/threonine-protein kinase B-raf
LigandBDBM50165875
Substrate/Competitorn/a
Meas. Tech.ChEMBL_1574501 (CHEMBL3804127)
IC50 8.0±n/a nM
Citation Liu, LLee, MRKim, JLWhittington, DABregman, HHua, ZLewis, RTMartin, MWNishimura, NPotashman, MYang, KYi, SVaida, KREpstein, LFBabij, CFernando, MCarnahan, JNorman, MH Purinylpyridinylamino-based DFG-in/aC-helix-out B-Raf inhibitors: Applying mutant versus wild-type B-Raf selectivity indices for compound profiling. Bioorg Med Chem24:2215-34 (2016) 
 
Serine/threonine-protein kinase B-raf
Name:Serine/threonine-protein kinase B-raf
Type:Serine/threonine-protein kinase
Mol. Mass.:84446.00
Organism:Homo sapiens (Human)
Description:P15056
Residue:766
BDBM50165875
NameBDBM50165875
Synonyms:CHEMBL3798570
TypeSmall organic molecule
Emp. Form.C20H17F2N7O2S
Mol. Mass.457.456
SMILESFc1ccc(NS(=O)(=O)CC2CC2)c(F)c1Nc1ncccc1-c1ncnc2[nH]cnc12