Reaction Details
TargetProto-oncogene tyrosine-protein kinase receptor Ret
LigandBDBM50165911
Substrate/Competitorn/a
Meas. Tech.ChEMBL_1575090 (CHEMBL3804157)
IC50 18±n/a nM
Citation Jordan, AMBegum, HFairweather, EFritzl, SGoldberg, KHopkins, GVHamilton, NMLyons, AJMarch, HNNewton, RSmall, HFVishwanath, SWaddell, IDWaszkowycz, BWatson, AJOgilvie, DJ Anilinoquinazoline inhibitors of the RET kinase domain-Elaboration of the 7-position. Bioorg Med Chem Lett26:2724-9 (2016) 
 
Proto-oncogene tyrosine-protein kinase receptor Ret
Name:Proto-oncogene tyrosine-protein kinase receptor Ret
Type:Protein
Mol. Mass.:124318.29
Organism:Homo sapiens (Human)
Description:P07949
Residue:1114
BDBM50165911
NameBDBM50165911
Synonyms:CHEMBL3800155
TypeSmall organic molecule
Emp. Form.C21H22FN3O4
Mol. Mass.399.4155
SMILESCOc1cc2c(Nc3c(F)ccc(O)c3C)ncnc2cc1OCC1CCCO1