Reaction Details
TargetProto-oncogene tyrosine-protein kinase receptor Ret
LigandBDBM50165942
Substrate/Competitorn/a
Meas. Tech.ChEMBL_1575090 (CHEMBL3804157)
IC50 15±n/a nM
Citation Jordan, AMBegum, HFairweather, EFritzl, SGoldberg, KHopkins, GVHamilton, NMLyons, AJMarch, HNNewton, RSmall, HFVishwanath, SWaddell, IDWaszkowycz, BWatson, AJOgilvie, DJ Anilinoquinazoline inhibitors of the RET kinase domain-Elaboration of the 7-position. Bioorg Med Chem Lett26:2724-9 (2016) 
 
Proto-oncogene tyrosine-protein kinase receptor Ret
Name:Proto-oncogene tyrosine-protein kinase receptor Ret
Type:Protein
Mol. Mass.:124318.29
Organism:Homo sapiens (Human)
Description:P07949
Residue:1114
BDBM50165942
NameBDBM50165942
Synonyms:CHEMBL3800542
TypeSmall organic molecule
Emp. Form.C23H27FN4O3
Mol. Mass.426.4839
SMILESCOc1cc2c(Nc3c(F)ccc(O)c3C)ncnc2cc1OCCCN1CCCC1