Reaction Details
TargetKinesin-1 heavy chain/Proto-oncogene tyrosine-protein kinase receptor Ret
LigandBDBM50165922
Substrate/Competitorn/a
Meas. Tech.ChEMBL_1575092 (CHEMBL3804159)
IC50 4600±n/a nM
Citation Jordan, AMBegum, HFairweather, EFritzl, SGoldberg, KHopkins, GVHamilton, NMLyons, AJMarch, HNNewton, RSmall, HFVishwanath, SWaddell, IDWaszkowycz, BWatson, AJOgilvie, DJ Anilinoquinazoline inhibitors of the RET kinase domain-Elaboration of the 7-position. Bioorg Med Chem Lett26:2724-9 (2016) 
 
Kinesin-1 heavy chain/Proto-oncogene tyrosine-protein kinase receptor Ret
Name:Kinesin-1 heavy chain/Proto-oncogene tyrosine-protein kinase receptor Ret
Synonyms:Kinesin-1 heavy chain/ Tyrosine-protein kinase receptor RET
Type:n/a
Mol. Mass.:n/a
Description:ASSAY_ID of ChEMBL is 1972971
Components:This complex has 2 components.
Component 1
Name:Proto-oncogene tyrosine-protein kinase receptor Ret
Type:Protein
Mol. Mass.:124318.29
Organism:Homo sapiens (Human)
Description:P07949
Residue:1114
Component 2
Name:Kinesin-1 heavy chain
Synonyms:KIF5B KNS | KNS1
Type:PROTEIN
Mol. Mass.:109682.61
Organism:Homo sapiens (Human)
Description:ChEMBL_770435
Residue:963
BDBM50165922
NameBDBM50165922
Synonyms:CHEMBL3799523
TypeSmall organic molecule
Emp. Form.C21H25FN4O3
Mol. Mass.400.4466
SMILESCOc1cc2c(Nc3c(F)ccc(O)c3C)ncnc2cc1OCCCN(C)C