Reaction Details
TargetLeucine-rich repeat serine/threonine-protein kinase 2
LigandBDBM50166005
Substrate/Competitorn/a
Meas. Tech.ChEMBL_1575146 (CHEMBL3804654)
Ki 355±n/a nM
Citation Greshock, TJSanders, JMDrolet, RERajapakse, HAChang, RKKim, BRada, VLTiscia, HESu, HLai, MTSur, SMSanchez, RIBilodeau, MTRenger, JJKern, JTMcCauley, JA Potent, selective and orally bioavailable leucine-rich repeat kinase 2 (LRRK2) inhibitors. Bioorg Med Chem Lett26:2631-5 (2016) 
 
Leucine-rich repeat serine/threonine-protein kinase 2
Name:Leucine-rich repeat serine/threonine-protein kinase 2
Type:Protein
Mol. Mass.:286113.20
Organism:Homo sapiens (Human)
Description:Q5S007
Residue:2527
BDBM50166005
NameBDBM50166005
Synonyms:CHEMBL3799978
TypeSmall organic molecule
Emp. Form.C13H15N3OS2
Mol. Mass.293.408
SMILESCCCSc1sc(-c2cc[nH]n2)c2CCNC(=O)c12