Reaction Details
TargetLeucine-rich repeat serine/threonine-protein kinase 2
LigandBDBM50165985
Substrate/Competitorn/a
Meas. Tech.ChEMBL_1575146 (CHEMBL3804654)
Ki 301±n/a nM
Citation Greshock, TJSanders, JMDrolet, RERajapakse, HAChang, RKKim, BRada, VLTiscia, HESu, HLai, MTSur, SMSanchez, RIBilodeau, MTRenger, JJKern, JTMcCauley, JA Potent, selective and orally bioavailable leucine-rich repeat kinase 2 (LRRK2) inhibitors. Bioorg Med Chem Lett26:2631-5 (2016) 
 
Leucine-rich repeat serine/threonine-protein kinase 2
Name:Leucine-rich repeat serine/threonine-protein kinase 2
Type:Protein
Mol. Mass.:286113.20
Organism:Homo sapiens (Human)
Description:Q5S007
Residue:2527
BDBM50165985
NameBDBM50165985
Synonyms:CHEMBL3799606
TypeSmall organic molecule
Emp. Form.C18H22N2O2S
Mol. Mass.330.444
SMILESCC1(C)Cc2c(sc(OC3CCCC3)c2C(=O)C1)-c1cc[nH]n1