Reaction Details
TargetLeucine-rich repeat serine/threonine-protein kinase 2
LigandBDBM50166070
Substrate/Competitorn/a
Meas. Tech.ChEMBL_1575145 (CHEMBL3804653)
Ki 120±n/a nM
Citation Greshock, TJSanders, JMDrolet, RERajapakse, HAChang, RKKim, BRada, VLTiscia, HESu, HLai, MTSur, SMSanchez, RIBilodeau, MTRenger, JJKern, JTMcCauley, JA Potent, selective and orally bioavailable leucine-rich repeat kinase 2 (LRRK2) inhibitors. Bioorg Med Chem Lett26:2631-5 (2016) 
 
Leucine-rich repeat serine/threonine-protein kinase 2
Name:Leucine-rich repeat serine/threonine-protein kinase 2
Type:Protein
Mol. Mass.:286113.20
Organism:Homo sapiens (Human)
Description:Q5S007
Residue:2527
BDBM50166070
NameBDBM50166070
Synonyms:CHEMBL3798994
TypeSmall organic molecule
Emp. Form.C17H15N3OS2
Mol. Mass.341.451
SMILESCSc1sc(-c2cc[nH]n2)c2C[C@H](NC(=O)c12)c1ccccc1