Reaction Details
TargetDeath-associated protein kinase 3
LigandBDBM50166251
Substrate/Competitorn/a
Meas. Tech.ChEMBL_1575380 (CHEMBL3802098)
IC50 140±n/a nM
Citation Jung, MEByun, BJKim, HMLee, JYPark, JHLee, NSon, YHChoi, SUYang, KMKim, SJLee, KKim, YCChoi, G Discovery of indirubin derivatives as new class of DRAK2 inhibitors from high throughput screening. Bioorg Med Chem Lett26:2719-23 (2016) 
 
Death-associated protein kinase 3
Name:Death-associated protein kinase 3
Type:PROTEIN
Mol. Mass.:52537.07
Organism:Homo sapiens (Human)
Description:ChEMBL_586564
Residue:454
BDBM50166251
NameBDBM50166251
Synonyms:CHEMBL3799389
TypeSmall organic molecule
Emp. Form.C20H16N4O3
Mol. Mass.360.366
SMILESO\N=C1\C(\Nc2ccccc\12)=C1\C(=O)Nc2ccc(NC(=O)C3CC3)cc12