Reaction Details
TargetDeath-associated protein kinase 3
LigandBDBM50166077
Substrate/Competitorn/a
Meas. Tech.ChEMBL_1575380 (CHEMBL3802098)
IC50 700±n/a nM
Citation Jung, MEByun, BJKim, HMLee, JYPark, JHLee, NSon, YHChoi, SUYang, KMKim, SJLee, KKim, YCChoi, G Discovery of indirubin derivatives as new class of DRAK2 inhibitors from high throughput screening. Bioorg Med Chem Lett26:2719-23 (2016) 
 
Death-associated protein kinase 3
Name:Death-associated protein kinase 3
Type:PROTEIN
Mol. Mass.:52537.07
Organism:Homo sapiens (Human)
Description:ChEMBL_586564
Residue:454
BDBM50166077
NameBDBM50166077
Synonyms:CHEMBL513703
TypeSmall organic molecule
Emp. Form.C21H20N4O3
Mol. Mass.376.4085
SMILESCC(C)(C)C(=O)Nc1ccc2NC(=O)\C(=C3/Nc4ccccc4/C/3=N\O)c2c1