Reaction Details
TargetDeath-associated protein kinase 2
LigandBDBM50166254
Substrate/Competitorn/a
Meas. Tech.ChEMBL_1575379 (CHEMBL3802097)
IC50 570±n/a nM
Citation Jung, MEByun, BJKim, HMLee, JYPark, JHLee, NSon, YHChoi, SUYang, KMKim, SJLee, KKim, YCChoi, G Discovery of indirubin derivatives as new class of DRAK2 inhibitors from high throughput screening. Bioorg Med Chem Lett26:2719-23 (2016) 
 
Death-associated protein kinase 2
Name:Death-associated protein kinase 2
Type:PROTEIN
Mol. Mass.:42900.09
Organism:Homo sapiens (Human)
Description:ChEMBL_774557
Residue:370
BDBM50166254
NameBDBM50166254
Synonyms:CHEMBL3797466
TypeSmall organic molecule
Emp. Form.C21H18N4O3
Mol. Mass.374.3926
SMILES[#6]\[#6](-[#6])=[#6]\[#6](=O)-[#7]-c1ccc2-[#7]-[#6](=O)\[#6](=[#6]3/[#7]-c4ccccc4/[#6]/3=[#7]\[#8])-c2c1