Reaction Details
TargetMitogen-activated protein kinase 3
LigandBDBM50166322
Substrate/Competitorn/a
Meas. Tech.ChEMBL_1575390 (CHEMBL3802287)
IC50 128±n/a nM
Citation Li, LLiu, FJin, NTang, SChen, ZYang, XDing, JGeng, MJiang, LHuang, MCao, J Discovery and structure activity relationship study of novel indazole amide inhibitors for extracellular signal-regulated kinase1/2 (ERK1/2). Bioorg Med Chem Lett26:2600-4 (2016) 
 
Mitogen-activated protein kinase 3
Name:Mitogen-activated protein kinase 3
Type:Protein
Mol. Mass.:43136.58
Organism:Homo sapiens (Human)
Description:curated by PDB 4QTB
Residue:379
BDBM50166322
NameBDBM50166322
Synonyms:CHEMBL3797548
TypeSmall organic molecule
Emp. Form.C22H20N4O2
Mol. Mass.372.4198
SMILESCC(CNC(=O)c1ccc2[nH]nc(-c3ccncc3)c2c1)Oc1ccccc1