Reaction Details
TargetMitogen-activated protein kinase 1
LigandBDBM50166568
Substrate/Competitorn/a
Meas. Tech.ChEMBL_1575391 (CHEMBL3802288)
IC50 23±n/a nM
Citation Li, LLiu, FJin, NTang, SChen, ZYang, XDing, JGeng, MJiang, LHuang, MCao, J Discovery and structure activity relationship study of novel indazole amide inhibitors for extracellular signal-regulated kinase1/2 (ERK1/2). Bioorg Med Chem Lett26:2600-4 (2016) 
 
Mitogen-activated protein kinase 1
Name:Mitogen-activated protein kinase 1
Type:Ser/Thr Protein Kinase
Mol. Mass.:41392.76
Organism:Homo sapiens (Human)
Description:P28482
Residue:360
BDBM50166568
NameBDBM50166568
Synonyms:CHEMBL3799614
TypeSmall organic molecule
Emp. Form.C19H14ClN5O
Mol. Mass.363.8
SMILESClc1cc(CNC(=O)c2ccc3[nH]nc(-c4ccncc4)c3c2)ccn1