Reaction Details
TargetMitogen-activated protein kinase 1
LigandBDBM50166572
Substrate/Competitorn/a
Meas. Tech.ChEMBL_1575391 (CHEMBL3802288)
IC50 9.5±n/a nM
Citation Li, LLiu, FJin, NTang, SChen, ZYang, XDing, JGeng, MJiang, LHuang, MCao, J Discovery and structure activity relationship study of novel indazole amide inhibitors for extracellular signal-regulated kinase1/2 (ERK1/2). Bioorg Med Chem Lett26:2600-4 (2016) 
 
Mitogen-activated protein kinase 1
Name:Mitogen-activated protein kinase 1
Type:Ser/Thr Protein Kinase
Mol. Mass.:41392.76
Organism:Homo sapiens (Human)
Description:P28482
Residue:360
BDBM50166572
NameBDBM50166572
Synonyms:CHEMBL3798624
TypeSmall organic molecule
Emp. Form.C22H18Cl2N4O
Mol. Mass.425.311
SMILESC[C@H](NC(=O)c1ccc2[nH]nc(-c3ccnc(C)c3)c2c1)c1c(Cl)cccc1Cl