Reaction Details
TargetMitogen-activated protein kinase 1
LigandBDBM50166412
Substrate/Competitorn/a
Meas. Tech.ChEMBL_1575391 (CHEMBL3802288)
IC50 7.9±n/a nM
Citation Li, LLiu, FJin, NTang, SChen, ZYang, XDing, JGeng, MJiang, LHuang, MCao, J Discovery and structure activity relationship study of novel indazole amide inhibitors for extracellular signal-regulated kinase1/2 (ERK1/2). Bioorg Med Chem Lett26:2600-4 (2016) 
 
Mitogen-activated protein kinase 1
Name:Mitogen-activated protein kinase 1
Type:Ser/Thr Protein Kinase
Mol. Mass.:41392.76
Organism:Homo sapiens (Human)
Description:P28482
Residue:360
BDBM50166412
NameBDBM50166412
Synonyms:CHEMBL3797917
TypeSmall organic molecule
Emp. Form.C20H14Cl3N5O
Mol. Mass.446.717
SMILESCc1cc(ccn1)-c1n[nH]c2ccc(cc12)C(=O)NCc1c(Cl)cnc(Cl)c1Cl