Reaction Details
TargetVascular endothelial growth factor receptor 1
LigandBDBM50166569
Substrate/Competitorn/a
Meas. Tech.ChEMBL_1575395 (CHEMBL3802292)
IC50>1000±n/a nM
Citation Li, LLiu, FJin, NTang, SChen, ZYang, XDing, JGeng, MJiang, LHuang, MCao, J Discovery and structure activity relationship study of novel indazole amide inhibitors for extracellular signal-regulated kinase1/2 (ERK1/2). Bioorg Med Chem Lett26:2600-4 (2016) 
 
Vascular endothelial growth factor receptor 1
Name:Vascular endothelial growth factor receptor 1
Type:Receptor Tyrosine Kinase
Mol. Mass.:150800.23
Organism:Homo sapiens (Human)
Description:P17948
Residue:1338
BDBM50166569
NameBDBM50166569
Synonyms:CHEMBL3798257
TypeSmall organic molecule
Emp. Form.C21H17Cl2N5O
Mol. Mass.426.299
SMILESCC(NC(=O)c1ccc2[nH]nc(-c3ccnc(C)c3)c2c1)c1c(Cl)cncc1Cl