Reaction Details
TargetEphrin type-A receptor 2
LigandBDBM50166350
Substrate/Competitorn/a
Meas. Tech.ChEMBL_1575403 (CHEMBL3802300)
IC50>1000±n/a nM
Citation Li, LLiu, FJin, NTang, SChen, ZYang, XDing, JGeng, MJiang, LHuang, MCao, J Discovery and structure activity relationship study of novel indazole amide inhibitors for extracellular signal-regulated kinase1/2 (ERK1/2). Bioorg Med Chem Lett26:2600-4 (2016) 
 
Ephrin type-A receptor 2
Name:Ephrin type-A receptor 2
Type:PROTEIN
Mol. Mass.:108260.70
Organism:Homo sapiens (Human)
Description:ChEMBL_1505248
Residue:976
BDBM50166350
NameBDBM50166350
Synonyms:CHEMBL3798631
TypeSmall organic molecule
Emp. Form.C21H17ClN4O
Mol. Mass.376.839
SMILESCC(NC(=O)c1ccc2[nH]nc(-c3ccncc3)c2c1)c1cccc(Cl)c1