Reaction Details
TargetMitogen-activated protein kinase 3
LigandBDBM50166429
Substrate/Competitorn/a
Meas. Tech.ChEMBL_1575390 (CHEMBL3802287)
IC50 67±n/a nM
Citation Li, LLiu, FJin, NTang, SChen, ZYang, XDing, JGeng, MJiang, LHuang, MCao, J Discovery and structure activity relationship study of novel indazole amide inhibitors for extracellular signal-regulated kinase1/2 (ERK1/2). Bioorg Med Chem Lett26:2600-4 (2016) 
 
Mitogen-activated protein kinase 3
Name:Mitogen-activated protein kinase 3
Type:Protein
Mol. Mass.:43136.58
Organism:Homo sapiens (Human)
Description:curated by PDB 4QTB
Residue:379
BDBM50166429
NameBDBM50166429
Synonyms:CHEMBL3797827
TypeSmall organic molecule
Emp. Form.C21H18ClN5O2
Mol. Mass.407.853
SMILESNc1cc(ccn1)-c1n[nH]c2ccc(cc12)C(=O)NC(CO)c1cccc(Cl)c1