Reaction Details
TargetMitogen-activated protein kinase 3
LigandBDBM50166430
Substrate/Competitorn/a
Meas. Tech.ChEMBL_1575390 (CHEMBL3802287)
IC50 32±n/a nM
Citation Li, LLiu, FJin, NTang, SChen, ZYang, XDing, JGeng, MJiang, LHuang, MCao, J Discovery and structure activity relationship study of novel indazole amide inhibitors for extracellular signal-regulated kinase1/2 (ERK1/2). Bioorg Med Chem Lett26:2600-4 (2016) 
 
Mitogen-activated protein kinase 3
Name:Mitogen-activated protein kinase 3
Type:Protein
Mol. Mass.:43136.58
Organism:Homo sapiens (Human)
Description:curated by PDB 4QTB
Residue:379
BDBM50166430
NameBDBM50166430
Synonyms:CHEMBL3798692
TypeSmall organic molecule
Emp. Form.C22H16ClF2N3O2
Mol. Mass.427.831
SMILESCC(NC(=O)c1ccc2[nH]nc(-c3cc(F)c(O)c(F)c3)c2c1)c1cccc(Cl)c1