Reaction Details
TargetProstaglandin E2 receptor EP3 subtype
LigandBDBM50166582
Substrate/Competitorn/a
Meas. Tech.ChEMBL_1575414 (CHEMBL3802311)
Ki 65±n/a nM
Citation Lee, ECFutatsugi, KArcari, JTBahnck, KCoffey, SBDerksen, DRKalgutkar, ASLoria, PMSharma, R Optimization of amide-based EP3 receptor antagonists. Bioorg Med Chem Lett26:2670-5 (2016) 
 
Prostaglandin E2 receptor EP3 subtype
Name:Prostaglandin E2 receptor EP3 subtype
Type:Enzyme
Mol. Mass.:43335.03
Organism:Homo sapiens (Human)
Description:P43115
Residue:390
BDBM50166582
NameBDBM50166582
Synonyms:CHEMBL3798781
TypeSmall organic molecule
Emp. Form.C18H19FN6O2S
Mol. Mass.402.446
SMILESCCn1ncc2c(F)cc(cc12)C(=O)Nc1nnc(s1)C1(C)CN(C1)C(C)=O