Reaction Details
TargetEphrin type-A receptor 5
LigandBDBM50166588
Substrate/Competitorn/a
Meas. Tech.ChEMBL_1576569 (CHEMBL3804240)
IC50>1000±n/a nM
Citation Katoh, TTakai, TYukawa, TTsukamoto, TWatanabe, EMototani, HArita, THayashi, HNakagawa, HKlein, MGZou, HSang, BCSnell, GNakada, Y Discovery and optimization of 1,7-disubstituted-2,2-dimethyl-2,3-dihydroquinazolin-4(1H)-ones as potent and selective PKC¿ inhibitors. Bioorg Med Chem24:2466-75 (2016) 
 
Ephrin type-A receptor 5
Name:Ephrin type-A receptor 5
Type:PROTEIN
Mol. Mass.:114807.59
Organism:Homo sapiens (Human)
Description:ChEMBL_774217
Residue:1037
BDBM50166588
NameBDBM50166588
Synonyms:CHEMBL3798011
TypeSmall organic molecule
Emp. Form.C24H23N5O2
Mol. Mass.413.4717
SMILESC[C@@H](N1c2cc(ccc2C(=O)NC1(C)C)-n1c2cccnc2[nH]c1=O)c1ccccc1