Reaction Details
TargetFatty-acid amide hydrolase 1
LigandBDBM26739
Substrate/Competitorn/a
Meas. Tech.ChEMBL_1572608 (CHEMBL3803141)
IC50 260±n/a nM
Citation Tuo, WLeleu-Chavain, NBarczyk, ARenault, NLemaire, LChavatte, PMillet, R Design, synthesis and biological evaluation of potent FAAH inhibitors. Bioorg Med Chem Lett26:2701-5 (2016) 
 
Fatty-acid amide hydrolase 1
Name:Fatty-acid amide hydrolase 1
Type:Protein
Mol. Mass.:63071.19
Organism:Homo sapiens (Human)
Description:O00519
Residue:579
BDBM26739
NameBDBM26739
Synonyms:3-(3-carbamoylphenyl)phenyl N-cyclohexylcarbamate URB 597 URB597 | US9187413, 1a (URB597)
TypeSmall organic molecule
Emp. Form.C20H22N2O3
Mol. Mass.338.4003
SMILESNC(=O)c1cccc(c1)-c1cccc(OC(=O)NC2CCCCC2)c1