Reaction Details
TargetFibroblast growth factor receptor 2
LigandBDBM50166643
Substrate/Competitorn/a
Meas. Tech.ChEMBL_1572615 (CHEMBL3803148)
IC50 108±n/a nM
Citation Fan, JDai, YShao, JPeng, XWang, CCao, SZhao, BAi, JGeng, MDuan, W Design, synthesis and biological evaluation of pyrazolylaminoquinazoline derivatives as highly potent pan-fibroblast growth factor receptor inhibitors. Bioorg Med Chem Lett26:2594-9 (2016) 
 
Fibroblast growth factor receptor 2
Name:Fibroblast growth factor receptor 2
Type:Enzyme
Mol. Mass.:92015.45
Organism:Homo sapiens (Human)
Description:P21802
Residue:821
BDBM50166643
NameBDBM50166643
Synonyms:CHEMBL3799093
TypeSmall organic molecule
Emp. Form.C27H32ClN7O2
Mol. Mass.522.042
SMILESCCN1CCN(CC1)c1ccc2c(Nc3cc(CCc4cc(OC)cc(OC)c4)[nH]n3)nc(Cl)nc2c1