Reaction Details
TargetFibroblast growth factor receptor 2
LigandBDBM50166736
Substrate/Competitorn/a
Meas. Tech.ChEMBL_1572613 (CHEMBL3803146)
IC50 0.400000±n/a nM
Citation Fan, JDai, YShao, JPeng, XWang, CCao, SZhao, BAi, JGeng, MDuan, W Design, synthesis and biological evaluation of pyrazolylaminoquinazoline derivatives as highly potent pan-fibroblast growth factor receptor inhibitors. Bioorg Med Chem Lett26:2594-9 (2016) 
 
Fibroblast growth factor receptor 2
Name:Fibroblast growth factor receptor 2
Type:Enzyme
Mol. Mass.:92015.45
Organism:Homo sapiens (Human)
Description:P21802
Residue:821
BDBM50166736
NameBDBM50166736
Synonyms:CHEMBL3797594
TypeSmall organic molecule
Emp. Form.C27H33N7O2
Mol. Mass.487.5966
SMILESCOc1cc(CCc2cc(Nc3ncnc4cc(ccc34)N3CCC(C3)N(C)C)n[nH]2)cc(OC)c1