Reaction Details
Target5-hydroxytryptamine receptor 6
LigandBDBM50166860
Substrate/Competitorn/a
Meas. Tech.ChEMBL_1572807 (CHEMBL3804531)
Ki 15±n/a nM
Citation Fabritius, CHPesonen, UMessinger, JHorvath, RSalo, HGalezowski, MGalek, MStefanska, KSzeremeta-Spisak, JOlszak-Plachta, MBuda, AAdamczyk, JKról, MPrusis, PSieprawska-Lupa, MMikulski, MKuokkanen, KChapman, HObuchowicz, RKorjamo, TJalava, NNowak, M 1-Sulfonyl-6-Piperazinyl-7-Azaindoles as potent and pseudo-selective 5-HT6 receptor antagonists. Bioorg Med Chem Lett26:2610-5 (2016) 
 
5-hydroxytryptamine receptor 6
Name:5-hydroxytryptamine receptor 6
Type:G Protein-Coupled Receptor (GPCR)
Mol. Mass.:46968.43
Organism:Homo sapiens (Human)
Description:P50406
Residue:440
BDBM50166860
NameBDBM50166860
Synonyms:CHEMBL3799330
TypeSmall organic molecule
Emp. Form.C25H29F3N4O2S
Mol. Mass.506.584
SMILESCN1CCN(CC1)c1cc(-c2ccc(cc2)C(F)(F)F)c2ccn(c2n1)S(=O)(=O)C1CCCCC1