Reaction Details
Target5-hydroxytryptamine receptor 6
LigandBDBM50166863
Substrate/Competitorn/a
Meas. Tech.ChEMBL_1572807 (CHEMBL3804531)
Ki 3.0±n/a nM
Citation Fabritius, CHPesonen, UMessinger, JHorvath, RSalo, HGalezowski, MGalek, MStefanska, KSzeremeta-Spisak, JOlszak-Plachta, MBuda, AAdamczyk, JKról, MPrusis, PSieprawska-Lupa, MMikulski, MKuokkanen, KChapman, HObuchowicz, RKorjamo, TJalava, NNowak, M 1-Sulfonyl-6-Piperazinyl-7-Azaindoles as potent and pseudo-selective 5-HT6 receptor antagonists. Bioorg Med Chem Lett26:2610-5 (2016) 
 
5-hydroxytryptamine receptor 6
Name:5-hydroxytryptamine receptor 6
Type:G Protein-Coupled Receptor (GPCR)
Mol. Mass.:46968.43
Organism:Homo sapiens (Human)
Description:P50406
Residue:440
BDBM50166863
NameBDBM50166863
Synonyms:CHEMBL3799529
TypeSmall organic molecule
Emp. Form.C22H25F3N4O2S
Mol. Mass.466.52
SMILESCC(C)CS(=O)(=O)n1ccc2c(cc(nc12)N1CCNCC1)-c1ccc(cc1)C(F)(F)F