Reaction Details
TargetD(2) dopamine receptor
LigandBDBM50166851
Substrate/Competitorn/a
Meas. Tech.ChEMBL_1572808 (CHEMBL3800738)
Ki 630±n/a nM
Citation Fabritius, CHPesonen, UMessinger, JHorvath, RSalo, HGalezowski, MGalek, MStefanska, KSzeremeta-Spisak, JOlszak-Plachta, MBuda, AAdamczyk, JKról, MPrusis, PSieprawska-Lupa, MMikulski, MKuokkanen, KChapman, HObuchowicz, RKorjamo, TJalava, NNowak, M 1-Sulfonyl-6-Piperazinyl-7-Azaindoles as potent and pseudo-selective 5-HT6 receptor antagonists. Bioorg Med Chem Lett26:2610-5 (2016) 
 
D(2) dopamine receptor
Name:D(2) dopamine receptor
Type:Cell-surface receptors
Mol. Mass.:50647.10
Organism:Homo sapiens (Human)
Description:P14416
Residue:443
BDBM50166851
NameBDBM50166851
Synonyms:CHEMBL3798840
TypeSmall organic molecule
Emp. Form.C23H27F3N4O2S
Mol. Mass.480.546
SMILESCC(C)CS(=O)(=O)n1ccc2c(cc(nc12)N1CCN(C)CC1)-c1cccc(c1)C(F)(F)F