Reaction Details
TargetEpidermal growth factor receptor
LigandBDBM50166941
Substrate/Competitorn/a
Meas. Tech.ChEMBL_1573292 (CHEMBL3804024)
IC50 272±n/a nM
Citation Xiao, QQu, RGao, DYan, QTong, LZhang, WDing, JXie, HLi, Y Discovery of 5-(methylthio)pyrimidine derivatives as L858R/T790M mutant selective epidermal growth factor receptor (EGFR) inhibitors. Bioorg Med Chem24:2673-80 (2016) 
 
Epidermal growth factor receptor
Name:Epidermal growth factor receptor
Type:Receptor Kinase Domain
Mol. Mass.:134279.59
Organism:Homo sapiens (Human)
Description:P00533
Residue:1210
BDBM50166941
NameBDBM50166941
Synonyms:CHEMBL3797606
TypeSmall organic molecule
Emp. Form.C26H30N6O3S
Mol. Mass.506.62
SMILESCOc1cc(ccc1Nc1ncc(SC)c(Oc2cccc(NC(=O)C=C)c2)n1)N1CCN(C)CC1