Reaction Details
TargetBeta-2 adrenergic receptor
LigandBDBM50166979
Substrate/Competitorn/a
Meas. Tech.ChEMBL_1573533 (CHEMBL3801488)
EC50 13±n/a nM
Citation Weichert, DStanek, MHübner, HGmeiner, P Structure-guided development of dualß2 adrenergic/dopamine D2 receptor agonists. Bioorg Med Chem24:2641-53 (2016) 
 
Beta-2 adrenergic receptor
Name:Beta-2 adrenergic receptor
Type:n/a
Mol. Mass.:46461.69
Organism:Homo sapiens (Human)
Description:P07550
Residue:413
BDBM50166979
NameBDBM50166979
Synonyms:CHEMBL3798748
TypeSmall organic molecule
Emp. Form.C28H32N2O6
Mol. Mass.492.5635
SMILESCOc1cc(CCNC[C@H](O)c2ccc(O)c3NC(=O)COc23)ccc1OCCCc1ccccc1