Reaction Details
TargetD(2) dopamine receptor
LigandBDBM50166979
Substrate/Competitorn/a
Meas. Tech.ChEMBL_1573521 (CHEMBL3801476)
Ki 130±n/a nM
Citation Weichert, DStanek, MHübner, HGmeiner, P Structure-guided development of dualß2 adrenergic/dopamine D2 receptor agonists. Bioorg Med Chem24:2641-53 (2016) 
 
D(2) dopamine receptor
Name:D(2) dopamine receptor
Type:Cell-surface receptors
Mol. Mass.:50647.10
Organism:Homo sapiens (Human)
Description:P14416
Residue:443
BDBM50166979
NameBDBM50166979
Synonyms:CHEMBL3798748
TypeSmall organic molecule
Emp. Form.C28H32N2O6
Mol. Mass.492.5635
SMILESCOc1cc(CCNC[C@H](O)c2ccc(O)c3NC(=O)COc23)ccc1OCCCc1ccccc1