Reaction Details
TargetD(2) dopamine receptor
LigandBDBM50166977
Substrate/Competitorn/a
Meas. Tech.ChEMBL_1573522 (CHEMBL3801477)
Ki 67±n/a nM
Citation Weichert, DStanek, MHübner, HGmeiner, P Structure-guided development of dualß2 adrenergic/dopamine D2 receptor agonists. Bioorg Med Chem24:2641-53 (2016) 
 
D(2) dopamine receptor
Name:D(2) dopamine receptor
Type:Cell-surface receptors
Mol. Mass.:50647.10
Organism:Homo sapiens (Human)
Description:P14416
Residue:443
BDBM50166977
NameBDBM50166977
Synonyms:CHEMBL3800303
TypeSmall organic molecule
Emp. Form.C26H31NO5
Mol. Mass.437.528
SMILESCOc1cc(CCNC[C@H](O)c2ccc(O)c(O)c2)ccc1OCCCc1ccccc1