Reaction Details
TargetD(2) dopamine receptor
LigandBDBM50018958
Substrate/Competitorn/a
Meas. Tech.ChEMBL_1573522 (CHEMBL3801477)
Ki 70±n/a nM
Citation Weichert, DStanek, MHübner, HGmeiner, P Structure-guided development of dualß2 adrenergic/dopamine D2 receptor agonists. Bioorg Med Chem24:2641-53 (2016) 
 
D(2) dopamine receptor
Name:D(2) dopamine receptor
Type:Cell-surface receptors
Mol. Mass.:50647.10
Organism:Homo sapiens (Human)
Description:P14416
Residue:443
BDBM50018958
NameBDBM50018958
Synonyms:CHEBI:75401 | QUINPIROLE
TypeSmall organic molecule
Emp. Form.C13H21N3
Mol. Mass.219.3259
SMILES[H][C@]12CCCN(CCC)[C@]1([H])Cc1c[nH]nc1C2