Reaction Details
TargetD(2) dopamine receptor
LigandBDBM25392
Substrate/Competitorn/a
Meas. Tech.ChEMBL_1573522 (CHEMBL3801477)
Ki 12000±n/a nM
Citation Weichert, DStanek, MHübner, HGmeiner, P Structure-guided development of dualß2 adrenergic/dopamine D2 receptor agonists. Bioorg Med Chem24:2641-53 (2016) 
 
D(2) dopamine receptor
Name:D(2) dopamine receptor
Type:Cell-surface receptors
Mol. Mass.:50647.10
Organism:Homo sapiens (Human)
Description:P14416
Residue:443
BDBM25392
NameBDBM25392
Synonyms:4-[1-hydroxy-2-(isopropylamino)ethyl]pyrocatechol;hydrochloride 4-{1-hydroxy-2-[(propan-2-yl)amino]ethyl}benzene-1,2-diol, 2 ISOPROTERONOL Isoproterenol Isoproterenol,(+) Norisodrine | Novodrin
TypeSmall organic molecule
Emp. Form.C11H17NO3
Mol. Mass.211.2576
SMILESCC(C)NCC(O)c1ccc(O)c(O)c1