Reaction Details
TargetBeta-1 adrenergic receptor
LigandBDBM50166979
Substrate/Competitorn/a
Meas. Tech.ChEMBL_1573518 (CHEMBL3801473)
Ki 5.1±n/a nM
Citation Weichert, DStanek, MHübner, HGmeiner, P Structure-guided development of dualß2 adrenergic/dopamine D2 receptor agonists. Bioorg Med Chem24:2641-53 (2016) 
 
Beta-1 adrenergic receptor
Name:Beta-1 adrenergic receptor
Type:PROTEIN
Mol. Mass.:50507.75
Organism:Mus musculus
Description:ChEMBL_105090
Residue:466
BDBM50166979
NameBDBM50166979
Synonyms:CHEMBL3798748
TypeSmall organic molecule
Emp. Form.C28H32N2O6
Mol. Mass.492.5635
SMILESCOc1cc(CCNC[C@H](O)c2ccc(O)c3NC(=O)COc23)ccc1OCCCc1ccccc1