Reaction Details
TargetP2Y purinoceptor 12
LigandBDBM50167271
Substrate/Competitorn/a
Meas. Tech.ChEMBL_1573764 (CHEMBL3802948)
IC50 2.0±n/a nM
Citation Zetterberg, FSvensson, P State of affairs: Design and structure-activity relationships of reversible P2Y12 receptor antagonists. Bioorg Med Chem Lett26:2739-2754 (2016) 
 
P2Y purinoceptor 12
Name:P2Y purinoceptor 12
Type:Enzyme
Mol. Mass.:39458.48
Organism:Homo sapiens (Human)
Description:Q9H244
Residue:342
BDBM50167271
NameBDBM50167271
Synonyms:CHEMBL3798413
TypeSmall organic molecule
Emp. Form.C22H26N10O2S
Mol. Mass.494.573
SMILESCCCSc1nc(N[C@@H]2C[C@H]2c2ccccc2)c2nnn([C@@H]3C[C@@H]([C@@H](O)[C@H]3O)c3nnn[nH]3)c2n1