Reaction Details
TargetP2Y purinoceptor 12
LigandBDBM50167273
Substrate/Competitorn/a
Meas. Tech.ChEMBL_1573770 (CHEMBL3802954)
IC50 5.3±n/a nM
Citation Zetterberg, FSvensson, P State of affairs: Design and structure-activity relationships of reversible P2Y12 receptor antagonists. Bioorg Med Chem Lett26:2739-2754 (2016) 
 
P2Y purinoceptor 12
Name:P2Y purinoceptor 12
Type:Enzyme
Mol. Mass.:39458.48
Organism:Homo sapiens (Human)
Description:Q9H244
Residue:342
BDBM50167273
NameBDBM50167273
Synonyms:CHEMBL3797316
TypeSmall organic molecule
Emp. Form.C27H34N4O9
Mol. Mass.558.5803
SMILESCCOC(=O)N1CCN(CC1)C(=O)[C@H](CCC(O)=O)NC(=O)c1cc(OC(C)(C)C(O)=O)c2ccc(C)cc2n1