Reaction Details
TargetMicrotubule-associated protein 2
LigandBDBM50167279
Substrate/Competitorn/a
Meas. Tech.ChEMBL_1573780 (CHEMBL3803201)
IC50 6.3±n/a nM
Citation McBride, CCheruvallath, ZKomandla, MTang, MFarrell, PLawson, JDVanderpool, DWu, YDougan, DRPlonowski, AHolub, CLarson, C Discovery of potent, reversible MetAP2 inhibitors via fragment based drug discovery and structure based drug design-Part 2. Bioorg Med Chem Lett26:2779-2783 (2016) 
 
Microtubule-associated protein 2
Name:Microtubule-associated protein 2
Type:PROTEIN
Mol. Mass.:199423.64
Organism:Homo sapiens (Human)
Description:ChEMBL_107603
Residue:1827
BDBM50167279
NameBDBM50167279
Synonyms:CHEMBL3799090
TypeSmall organic molecule
Emp. Form.C19H17FN4O2
Mol. Mass.352.3623
SMILESCc1cc(ccc1-n1c2cn[nH]c2c2cc(F)ccc12)C(=O)NCCO