Reaction Details
TargetMicrotubule-associated protein 2
LigandBDBM50167277
Substrate/Competitorn/a
Meas. Tech.ChEMBL_1573780 (CHEMBL3803201)
IC50 13±n/a nM
Citation McBride, CCheruvallath, ZKomandla, MTang, MFarrell, PLawson, JDVanderpool, DWu, YDougan, DRPlonowski, AHolub, CLarson, C Discovery of potent, reversible MetAP2 inhibitors via fragment based drug discovery and structure based drug design-Part 2. Bioorg Med Chem Lett26:2779-2783 (2016) 
 
Microtubule-associated protein 2
Name:Microtubule-associated protein 2
Type:PROTEIN
Mol. Mass.:199423.64
Organism:Homo sapiens (Human)
Description:ChEMBL_107603
Residue:1827
BDBM50167277
NameBDBM50167277
Synonyms:CHEMBL3797386
TypeSmall organic molecule
Emp. Form.C14H9FN4
Mol. Mass.252.2465
SMILESFc1ccc2n(-c3cccnc3)c3cn[nH]c3c2c1