Reaction Details
TargetMicrotubule-associated protein 2
LigandBDBM50167318
Substrate/Competitorn/a
Meas. Tech.ChEMBL_1573780 (CHEMBL3803201)
IC50 79±n/a nM
Citation McBride, CCheruvallath, ZKomandla, MTang, MFarrell, PLawson, JDVanderpool, DWu, YDougan, DRPlonowski, AHolub, CLarson, C Discovery of potent, reversible MetAP2 inhibitors via fragment based drug discovery and structure based drug design-Part 2. Bioorg Med Chem Lett26:2779-2783 (2016) 
 
Microtubule-associated protein 2
Name:Microtubule-associated protein 2
Type:PROTEIN
Mol. Mass.:199423.64
Organism:Homo sapiens (Human)
Description:ChEMBL_107603
Residue:1827
BDBM50167318
NameBDBM50167318
Synonyms:CHEMBL3797789
TypeSmall organic molecule
Emp. Form.C9H6FN3
Mol. Mass.175.1624
SMILESFc1ccc2[nH]c3cn[nH]c3c2c1