Reaction Details
TargetCytochrome P450 1A2
LigandBDBM50167285
Substrate/Competitorn/a
Meas. Tech.ChEMBL_1573782 (CHEMBL3803203)
IC50<50119±n/a nM
Citation McBride, CCheruvallath, ZKomandla, MTang, MFarrell, PLawson, JDVanderpool, DWu, YDougan, DRPlonowski, AHolub, CLarson, C Discovery of potent, reversible MetAP2 inhibitors via fragment based drug discovery and structure based drug design-Part 2. Bioorg Med Chem Lett26:2779-2783 (2016) 
 
Cytochrome P450 1A2
Name:Cytochrome P450 1A2
Type:Enzyme
Mol. Mass.:58423.38
Organism:Homo sapiens (Human)
Description:P05177
Residue:516
BDBM50167285
NameBDBM50167285
Synonyms:CHEMBL3797780
TypeSmall organic molecule
Emp. Form.C16H11FN6
Mol. Mass.306.2971
SMILESCc1c(cnc2[nH]cnc12)-n1c2cn[nH]c2c2cc(F)ccc12