Reaction Details
TargetTyrosine-protein kinase JAK3
LigandBDBM50355501
Substrate/Competitorn/a
Meas. Tech.ChEMBL_1573796 (CHEMBL3803217)
IC50 487±n/a nM
Citation Liang, XHuang, YZang, JGao, QWang, BXu, WZhang, Y Design, synthesis and preliminary biological evaluation of 4-aminopyrazole derivatives as novel and potent JAKs inhibitors. Bioorg Med Chem24:2660-72 (2016) 
 
Tyrosine-protein kinase JAK3
Name:Tyrosine-protein kinase JAK3
Type:Protein
Mol. Mass.:125111.08
Organism:Homo sapiens (Human)
Description:P52333
Residue:1124
BDBM50355501
NameBDBM50355501
Synonyms:INCB-018424 RUXOLITINIB PHOSPHATE US10766894, Compound TABLE 1.1 US11203595, TABLE 1.1 | US11279703, TABLE 6.147
TypeSmall organic molecule
Emp. Form.C17H18N6
Mol. Mass.306.365
SMILESN#CC[C@H](C1CCCC1)n1cc(cn1)-c1ncnc2[nH]ccc12