Reaction Details
TargetTryptophan 5-hydroxylase 1
LigandBDBM50167399
Substrate/Competitorn/a
Meas. Tech.ChEBML_1574259
IC50 11±n/a nM
Citation Goldberg, DRDe Lombaert, SAiello, RBourassa, PBarucci, NZhang, QParalkar, VStein, AJValentine, JZavadoski, W Discovery of acyl guanidine tryptophan hydroxylase-1 inhibitors. Bioorg Med Chem Lett26:2855-2860 (2016) 
 
Tryptophan 5-hydroxylase 1
Name:Tryptophan 5-hydroxylase 1
Type:PROTEIN
Mol. Mass.:50990.64
Organism:Homo sapiens (Human)
Description:ChEMBL_1361824
Residue:444
BDBM50167399
NameBDBM50167399
Synonyms:CHEMBL3800151
TypeSmall organic molecule
Emp. Form.C30H35N5O4
Mol. Mass.529.63
SMILESCc1ccccc1Oc1cccc(N2CCCCC2)c1CN\C(N)=N\C(=O)c1ccc(C[C@H](N)C(O)=O)cc1