Reaction Details
TargetTryptophan 5-hydroxylase 1
LigandBDBM50167425
Substrate/Competitorn/a
Meas. Tech.ChEBML_1574259
IC50 10.0±n/a nM
Citation Goldberg, DRDe Lombaert, SAiello, RBourassa, PBarucci, NZhang, QParalkar, VStein, AJValentine, JZavadoski, W Discovery of acyl guanidine tryptophan hydroxylase-1 inhibitors. Bioorg Med Chem Lett26:2855-2860 (2016) 
 
Tryptophan 5-hydroxylase 1
Name:Tryptophan 5-hydroxylase 1
Type:PROTEIN
Mol. Mass.:50990.64
Organism:Homo sapiens (Human)
Description:ChEMBL_1361824
Residue:444
BDBM50167425
NameBDBM50167425
Synonyms:CHEMBL3799810
TypeSmall organic molecule
Emp. Form.C30H35N5O5
Mol. Mass.545.6294
SMILESCOc1ccccc1Oc1cccc(N2CCCCC2)c1CN\C(N)=N\C(=O)c1ccc(C[C@H](N)C(O)=O)cc1