Reaction Details
TargetMicrotubule-associated protein 2
LigandBDBM50167909
Substrate/Competitorn/a
Meas. Tech.ChEMBL_1574297 (CHEMBL3802682)
IC50 20±n/a nM
Citation Cheruvallath, ZTang, MMcBride, CKomandla, MMiura, JTon-Nu, TErikson, PFeng, JFarrell, PLawson, JDVanderpool, DWu, YDougan, DRPlonowski, AHolub, CLarson, C Discovery of potent, reversible MetAP2 inhibitors via fragment based drug discovery and structure based drug design-Part 1. Bioorg Med Chem Lett26:2774-2778 (2016) 
 
Microtubule-associated protein 2
Name:Microtubule-associated protein 2
Type:PROTEIN
Mol. Mass.:199423.64
Organism:Homo sapiens (Human)
Description:ChEMBL_107603
Residue:1827
BDBM50167909
NameBDBM50167909
Synonyms:CHEMBL3798509
TypeSmall organic molecule
Emp. Form.C14H9F3N2
Mol. Mass.262.2299
SMILESFC(F)(F)c1cc(-c2ccccc2)c2cn[nH]c2c1