Reaction Details
TargetCytochrome P450 1A2
LigandBDBM50167916
Substrate/Competitorn/a
Meas. Tech.ChEMBL_1574299 (CHEMBL3802684)
IC50 316±n/a nM
Citation Cheruvallath, ZTang, MMcBride, CKomandla, MMiura, JTon-Nu, TErikson, PFeng, JFarrell, PLawson, JDVanderpool, DWu, YDougan, DRPlonowski, AHolub, CLarson, C Discovery of potent, reversible MetAP2 inhibitors via fragment based drug discovery and structure based drug design-Part 1. Bioorg Med Chem Lett26:2774-2778 (2016) 
 
Cytochrome P450 1A2
Name:Cytochrome P450 1A2
Type:Enzyme
Mol. Mass.:58423.38
Organism:Homo sapiens (Human)
Description:P05177
Residue:516
BDBM50167916
NameBDBM50167916
Synonyms:CHEMBL3798615
TypeSmall organic molecule
Emp. Form.C14H7F3N4
Mol. Mass.288.2274
SMILESFC(F)(F)c1cc(-c2cncc(c2)C#N)c2cn[nH]c2c1