Reaction Details
TargetMicrotubule-associated protein 2
LigandBDBM50167927
Substrate/Competitorn/a
Meas. Tech.ChEMBL_1574308 (CHEMBL3802693)
EC50 60±n/a nM
Citation Cheruvallath, ZTang, MMcBride, CKomandla, MMiura, JTon-Nu, TErikson, PFeng, JFarrell, PLawson, JDVanderpool, DWu, YDougan, DRPlonowski, AHolub, CLarson, C Discovery of potent, reversible MetAP2 inhibitors via fragment based drug discovery and structure based drug design-Part 1. Bioorg Med Chem Lett26:2774-2778 (2016) 
 
Microtubule-associated protein 2
Name:Microtubule-associated protein 2
Type:PROTEIN
Mol. Mass.:199423.64
Organism:Homo sapiens (Human)
Description:ChEMBL_107603
Residue:1827
BDBM50167927
NameBDBM50167927
Synonyms:CHEMBL3800090
TypeSmall organic molecule
Emp. Form.C18H16F3N3O2
Mol. Mass.363.3337
SMILESCc1cc(ccc1-c1cc(cc2[nH]ncc12)C(F)(F)F)C(=O)NCCO