Reaction Details
TargetC-terminal-binding protein 2
LigandBDBM50167965
Substrate/Competitorn/a
Meas. Tech.ChEMBL_1574551 (CHEMBL3804623)
IC50>300000±n/a nM
Citation Korwar, SMorris, BLParikh, HICoover, RADoughty, TWLove, IMHilbert, BJRoyer, WEKellogg, GEGrossman, SREllis, KC Design, synthesis, and biological evaluation of substrate-competitive inhibitors of C-terminal Binding Protein (CtBP). Bioorg Med Chem24:2707-15 (2016) 
 
C-terminal-binding protein 2
Name:C-terminal-binding protein 2
Type:Protein
Mol. Mass.:48948.33
Organism:Homo sapiens (Human)
Description:P56545
Residue:445
BDBM50167965
NameBDBM50167965
Synonyms:CHEMBL3248231 | US11192850, Compound 1
TypeSmall organic molecule
Emp. Form.C8H7NO3
Mol. Mass.165.1461
SMILESOC(=O)C(=O)Nc1ccccc1