Reaction Details
TargetC-terminal-binding protein 2
LigandBDBM50167967
Substrate/Competitorn/a
Meas. Tech.ChEMBL_1574551 (CHEMBL3804623)
IC50 240±n/a nM
Citation Korwar, SMorris, BLParikh, HICoover, RADoughty, TWLove, IMHilbert, BJRoyer, WEKellogg, GEGrossman, SREllis, KC Design, synthesis, and biological evaluation of substrate-competitive inhibitors of C-terminal Binding Protein (CtBP). Bioorg Med Chem24:2707-15 (2016) 
 
C-terminal-binding protein 2
Name:C-terminal-binding protein 2
Type:Protein
Mol. Mass.:48948.33
Organism:Homo sapiens (Human)
Description:P56545
Residue:445
BDBM50167967
NameBDBM50167967
Synonyms:CHEMBL3797778
TypeSmall organic molecule
Emp. Form.C9H9NO3
Mol. Mass.179.1727
SMILESO\N=C(\Cc1ccccc1)C(O)=O