Reaction Details
TargetC-terminal-binding protein 2
LigandBDBM50167970
Substrate/Competitorn/a
Meas. Tech.ChEMBL_1574551 (CHEMBL3804623)
IC50 480±n/a nM
Citation Korwar, SMorris, BLParikh, HICoover, RADoughty, TWLove, IMHilbert, BJRoyer, WEKellogg, GEGrossman, SREllis, KC Design, synthesis, and biological evaluation of substrate-competitive inhibitors of C-terminal Binding Protein (CtBP). Bioorg Med Chem24:2707-15 (2016) 
 
C-terminal-binding protein 2
Name:C-terminal-binding protein 2
Type:Protein
Mol. Mass.:48948.33
Organism:Homo sapiens (Human)
Description:P56545
Residue:445
BDBM50167970
NameBDBM50167970
Synonyms:CHEMBL3800187
TypeSmall organic molecule
Emp. Form.C10H11NO3
Mol. Mass.193.1992
SMILESCc1cccc(C\C(=N\O)C(O)=O)c1